2,2,4,4,6,8,10-heptamethyl-6,8,10-tri(2-cyanoethyl)-[1,3,5,7,9,2,4,6,8,10]cyclopentasiloxane

Normal alkane RI, non-polar column, temperature ramp

View large format table.

Column type Active phase I Reference Comment
CapillaryMethyl Silicone2359.Fujimoto, Ohtani, et al., 199025. m/0.25 mm/0.1 μm, He, 5. K/min; Tstart: 40. C; Tend: 350. C

References

Fujimoto, Ohtani, et al., 1990
Fujimoto, S.; Ohtani, H.; Yamagiwa, K.; Tsuge, S., Study on retention behavior of cyclic siloxanes by high resolution pyrolysis-gas chromatography with a fused silica capillary column, J. Hi. Res. Chromatogr., 1990, 13, 6, 397-404, https://doi.org/10.1002/jhrc.1240130603 . [all data]