Cyclohexene, 1-bromo-4-methyl

Van Den Dool and Kratz RI, polar column, temperature ramp

Data compiled by: NIST Mass Spectrometry Data Center, William E. Wallace, director

Column type Packed
Active phase Carbowax 20M
Column length (m) 3.05
Carrier gas He
Substrate Supelcoport
Column diameter (mm)
Phase thickness (μm)
Tstart (C) 40.
Tend (C) 210.
Heat rate (K/min) 10.
Initial hold (min) 10.
Final hold (min) 30.
I 1361.
ReferenceBuchman, Cao, et al., 1984
Comment MSDC-RI

References

Buchman, Cao, et al., 1984
Buchman, O.; Cao, G.-Y.; Peng, C.T., Structure assignment by retention index in gas-liquid radiochromatography of substituted cyclohexenes, J. Chromatogr., 1984, 312, 75-90, https://doi.org/10.1016/S0021-9673(01)92765-7 . [all data]