5,6-Dihydro-2,4,6-triisopropyl-4H-1,3,5-dithiazine

Normal alkane RI, polar column, temperature ramp

View large format table.

Column type Active phase I Reference Comment
CapillaryFFAP1930.Vernin, Metzger, et al., 199360. C @ 8. min, 2. K/min; Column length: 50. m; Column diameter: 0.22 mm; Tend: 230. C

References

Vernin, Metzger, et al., 1993
Vernin, G.; Metzger, J.; Sultan, A.A.M.; El-Shafei, A.K.; Párkányi, C., Heterocyclic compounds in model systems for the Maillard reaction. Reactions of aldehydes with ammonium sulfide in the presence or absence of acetoin, Am. Chem. Soc. Symp. Ser., 1993, 528, 36-55. [all data]