Ethyl β-methyl-β-phenyl-glycolate

Van Den Dool and Kratz RI, polar column, temperature ramp

Data compiled by: NIST Mass Spectrometry Data Center, William E. Wallace, director

Column type CapillaryCapillary
Active phase DB-WaxDB-Wax
Column length (m) 30.30.
Carrier gas
Substrate
Column diameter (mm) 0.250.25
Phase thickness (μm)
Tstart (C) 50.50.
Tend (C) 240.240.
Heat rate (K/min) 2.2.
Initial hold (min)
Final hold (min)
I 2213.72218.1
ReferenceChang, Sheng, et al., 1989Chang, Sheng, et al., 1989
Comment MSDC-RI MSDC-RI

References

Chang, Sheng, et al., 1989
Chang, L.P.; Sheng, L.S.; Yang, M.Z.; An, D.K., Retention index of essential oil in temperature-programmed capillary column gas chromatography, Acta Pharm. Sin., 1989, 24, 11, 847-852. [all data]