Dehydroxy-20-hydroxy-methylprednisolone, MO-triTMS (2)

Normal alkane RI, non-polar column, temperature ramp

View large format table.

Column type Active phase I Reference Comment
CapillaryCross-Linked Methylsilicone3296.Rodchenkov, Uralets, et al., 198725. m/0.2 mm/0.11 μm, He, 2. K/min; Tstart: 220. C; Tend: 270. C

References

Rodchenkov, Uralets, et al., 1987
Rodchenkov, G.M.; Uralets, V.P.; Semenov, V.A., Determination of methylprednisolone metabolites in human urine by gas chromatography-mass spectrometry, J. Chromatogr., 1987, 423, 15-22, https://doi.org/10.1016/0378-4347(87)80323-7 . [all data]