Pregnanedione, MO TMS

Van Den Dool and Kratz RI, non-polar column, custom temperature program

View large format table.

Column type Active phase I Reference Comment
CapillaryBP-12868.Hähnel, Wilkinson, et al., 1985He; Column length: 25. m; Column diameter: 0.3 mm; Program: 40C (1min) => 20C/min => 200C => 2C/min => 300C (11min)

References

Hähnel, Wilkinson, et al., 1985
Hähnel, E.; Wilkinson, S.P.; Hähnel, R., Urinary steroid profiles in pregnancy by capillary column gas chromatography, Clin. Chim. Acta, 1985, 151, 3, 259-271, https://doi.org/10.1016/0009-8981(85)90089-0 . [all data]