5-β-Pregnane-3β, 16α, 20α-triol, MO TMS

Van Den Dool and Kratz RI, non-polar column, custom temperature program

View large format table.

Column type Active phase I Reference Comment
CapillaryBP-12906.Hähnel, Wilkinson, et al., 1985He; Column length: 25. m; Column diameter: 0.3 mm; Program: 40C (1min) => 20C/min => 200C => 2C/min => 300C (11min)
CapillaryBP-12894.Hähnel, Wilkinson, et al., 1985He; Column length: 25. m; Column diameter: 0.3 mm; Program: 40C (1min) => 20C/min => 200C => 2C/min => 300C (11min)

Normal alkane RI, non-polar column, temperature ramp

View large format table.

Column type Active phase I Reference Comment
CapillarySE-522872.Honour, Tourniaire, et al., 1978Helium, 2. K/min; Column length: 19. m; Column diameter: 0.40 mm; Tstart: 160. C; Tend: 260. C

References

Hähnel, Wilkinson, et al., 1985
Hähnel, E.; Wilkinson, S.P.; Hähnel, R., Urinary steroid profiles in pregnancy by capillary column gas chromatography, Clin. Chim. Acta, 1985, 151, 3, 259-271, https://doi.org/10.1016/0009-8981(85)90089-0 . [all data]

Honour, Tourniaire, et al., 1978
Honour, J.W.; Tourniaire, J.; Biglieri, E.G.; Shackleton, C.H.L., Urinary steroid excretion in 17alpha-hydroxylase deficiency, J. Steroid Biochem., 1978, 9, 6, 495-505, https://doi.org/10.1016/0022-4731(78)90115-2 . [all data]