11β-hydroxy-androsterone, 3α,11β-dihydroxy-5α-androstane-17-one

Normal alkane RI, non-polar column, temperature ramp

View large format table.

Column type Active phase I Reference Comment
CapillaryOV-1012715.Vrbanac, Sweeley, et al., 198325. m/0.32 mm/0.3 μm, 2. K/min; Tstart: 180. C; Tend: 280. C

References

Vrbanac, Sweeley, et al., 1983
Vrbanac, J.J.; Sweeley, C.C.; Pinkston, J.D., Automated metabolic profiling analysis of urinary steroids by a gas chromatography mass spectrometry data system, Biomed. Mass Spectrom., 1983, 10, 3, 155-161, https://doi.org/10.1002/bms.1200100309 . [all data]