Pentacosane, 3-ethyl

Kovats' RI, non-polar column, isothermal

View large format table.

Column type Active phase Temperature (C) I Reference Comment
CapillaryDexsil 300220.2667.Szafranek, Kusmierz, et al., 1982He; Column length: 30. m; Column diameter: 0.30 mm

References

Szafranek, Kusmierz, et al., 1982
Szafranek, J.; Kusmierz, J.; Czerwiec, W., Gas chromatographic-mass spectrometric investigations of high-boiling crude oil alkane fractions, J. Chromatogr., 1982, 245, 2, 219-228, https://doi.org/10.1016/S0021-9673(00)88591-X . [all data]