N,N-diethyl-p-ethylaniline

Kovats' RI, non-polar column, isothermal

View large format table.

Column type Active phase Temperature (C) I Reference Comment
PackedApiezon N190.1423.Ellis and Still, 1979Celite 545
PackedApiezon N190.1424.8Ellis and Still, 1979Celite 545

Kovats' RI, polar column, isothermal

View large format table.

Column type Active phase Temperature (C) I Reference Comment
PackedCarbowax 20M165.1791.4Ellis and Still, 1979Chromosorb W, AW-DMCS
PackedCarbowax 20M165.1791.4Ellis and Still, 1979Chromosorb W, AW-DMCS
PackedCarbowax 20M165.1792.2Ellis and Still, 1979Chromosorb W, AW-DMCS

References

Ellis and Still, 1979
Ellis, T.S.; Still, R.H., Thermal degradation of polymers. XXIII. Vacuum pyrolysis of poly(p-N,N-dimethylaminostyrene); the products volatile at pyrolysis temperature, liquid or gaseous at room temperature, J. Appl. Polym. Sci., 1979, 23, 10, 2871-2880, https://doi.org/10.1002/app.1979.070231004 . [all data]