onocerane-II

Kovats' RI, non-polar column, isothermal

Data compiled by: NIST Mass Spectrometry Data Center, William E. Wallace, director

Column type Capillary
Active phase OV-101
Column length (m) 23.
Carrier gas He
Substrate
Column diameter (mm) 0.3
Phase thickness (μm)
Temperature (C) 250.
I 3012.
ReferenceKimble, Maxwell, et al., 1974
Comment MSDC-RI

References

Kimble, Maxwell, et al., 1974
Kimble, B.J.; Maxwell, J.R.; Philp, R.P.; Eglinton, G., Identification of steranes and triterpanes in geolipid extracts by high-resolution gas chromatography and mass spectrometry, Chem. Geol., 1974, 14, 3, 173-198, https://doi.org/10.1016/0009-2541(74)90127-2 . [all data]