decene-2-ol-4

Kovats' RI, non-polar column, isothermal

View large format table.

Column type Active phase Temperature (C) I Reference Comment
PackedSE-30175.1059.Casteignau and Villessot, 1968Column length: 3. m

Kovats' RI, polar column, isothermal

View large format table.

Column type Active phase Temperature (C) I Reference Comment
PackedCarbowax 20M175.1460.Casteignau and Villessot, 1968Column length: 3. m

References

Casteignau and Villessot, 1968
Casteignau, G.; Villessot, D., Identification par chromatographie en phase gaseuse de composés difonctionnels insaturés. I. Synthèse et indices de rétention, Bull. Soc. Chim. Fr., 1968, 9, 3893-3903. [all data]