1-Caffeoyl quinic acid, TMS

Van Den Dool and Kratz RI, non-polar column, temperature ramp

View large format table.

Column type Active phase I Reference Comment
CapillaryRTX-5Sil MS3397.0Wagner, Sefkow, et al., 2003He, 80. C @ 2. min, 18. K/min, 350. C @ 2. min; Column length: 30. m; Column diameter: 0.25 mm

References

Wagner, Sefkow, et al., 2003
Wagner, C.; Sefkow, M.; Kopka, J., Construction and application of a mass spectral and retention time index database generated from plant GC/EI-TOF-MS metabolite profiles, Phytochemistry, 2003, 62, 6, 887-900, https://doi.org/10.1016/S0031-9422(02)00703-3 . [all data]