4,5-di-epi-Aristolochene

Normal alkane RI, polar column, temperature ramp

Data compiled by: NIST Mass Spectrometry Data Center, William E. Wallace, director

Column type Capillary
Active phase BP-20
Column length (m) 50.
Carrier gas
Substrate
Column diameter (mm) 0.22
Phase thickness (μm) 0.25
Tstart (C) 60.
Tend (C) 220.
Heat rate (K/min) 2.
Initial hold (min)
Final hold (min) 20.
I 1665.
ReferenceBlanc, Muselli, et al., 2004
Comment MSDC-RI

References

Blanc, Muselli, et al., 2004
Blanc, M.-C.; Muselli, A.; Bradesi, P.; Casanova, J., Chemical composition and variability of the essential oil of Inula graveolens from Corsica, Flavour Fragr. J., 2004, 19, 4, 314-319, https://doi.org/10.1002/ffj.1304 . [all data]