3,10-Dihydro-1,4-dimethylazulene

Normal alkane RI, non-polar column, temperature ramp

Data compiled by: NIST Mass Spectrometry Data Center, William E. Wallace, director

Column type Capillary
Active phase DB-1
Column length (m) 50.
Carrier gas N2
Substrate
Column diameter (mm) 0.25
Phase thickness (μm) 0.25
Tstart (C) 95.
Tend (C) 240.
Heat rate (K/min) 4.
Initial hold (min)
Final hold (min)
I 1322.
ReferenceVelasco-Negueruela, Pérez-Alonso, et al., 2002
Comment MSDC-RI

References

Velasco-Negueruela, Pérez-Alonso, et al., 2002
Velasco-Negueruela, A.; Pérez-Alonso, M.J.; de Paz, P.L.P.; Vallejo, C.G.; Palá-Paúl, J.; Iñigo, A., Chemical composition of the essential oils from the roots, fruits, leaves and stems of Pimpinella cumbrae link growing in the Canary Islands (Spain), Flavour Fragr. J., 2002, 17, 6, 468-471, https://doi.org/10.1002/ffj.1131 . [all data]