Pseudoisoeugenyl-2-methyl butyrate

Normal alkane RI, non-polar column, temperature ramp

Data compiled by: NIST Mass Spectrometry Data Center, William E. Wallace, director

Column type CapillaryCapillary
Active phase Cross-Linked MethylsiliconeDB-1
Column length (m) 25.50.
Carrier gas HeN2
Substrate
Column diameter (mm) 0.20.25
Phase thickness (μm) 0.330.25
Tstart (C) 70.95.
Tend (C) 250.240.
Heat rate (K/min) 4.4.
Initial hold (min)
Final hold (min)
I 1792.1795.
ReferenceVelasco-Negueruela, Pérez-Alonso, et al., 2003Velasco-Negueruela, Pérez-Alonso, et al., 2002
Comment MSDC-RI MSDC-RI

References

Velasco-Negueruela, Pérez-Alonso, et al., 2003
Velasco-Negueruela, A.; Pérez-Alonso, M.J.; Pérez de Paz, P.L.; Palá-Paúl, J.; Sanz, J., Analysis by gas chromatography-mass spectrometry of the essential oil from the aerial parts of Pimpinella junoniae Ceb. Ort., gathered in La Gomera, Canary Islands, Spain, J. Chromatogr. A, 2003, 1011, 1-2, 241-244, https://doi.org/10.1016/S0021-9673(03)01082-3 . [all data]

Velasco-Negueruela, Pérez-Alonso, et al., 2002
Velasco-Negueruela, A.; Pérez-Alonso, M.J.; de Paz, P.L.P.; Vallejo, C.G.; Palá-Paúl, J.; Iñigo, A., Chemical composition of the essential oils from the roots, fruits, leaves and stems of Pimpinella cumbrae link growing in the Canary Islands (Spain), Flavour Fragr. J., 2002, 17, 6, 468-471, https://doi.org/10.1002/ffj.1131 . [all data]