Bisabolone

Normal alkane RI, polar column, temperature ramp

Data compiled by: NIST Mass Spectrometry Data Center, William E. Wallace, director

Column type Capillary
Active phase TC-Wax
Column length (m) 60.
Carrier gas
Substrate
Column diameter (mm) 0.25
Phase thickness (μm)
Tstart (C) 80.
Tend (C) 240.
Heat rate (K/min) 3.
Initial hold (min)
Final hold (min)
I 2036.
ReferenceMiyazawa, Yamafuji, et al., 2003
Comment MSDC-RI

References

Miyazawa, Yamafuji, et al., 2003
Miyazawa, M.; Yamafuji, C.; Kurose, K.; Ishikawa, Y., Volatile components of the rhizomes of Cirsium japonicum DC, Flavour Fragr. J., 2003, 18, 1, 15-17, https://doi.org/10.1002/ffj.1135 . [all data]