bisabolene-2-ol

Kovats' RI, non-polar column, temperature ramp

View large format table.

Column type Active phase I Reference Comment
CapillaryDB-11618.Mevy, Bessiere, et al., 2002He, 3. K/min; Column length: 25. m; Column diameter: 0.2 mm; Tstart: 60. C; Tend: 220. C

References

Mevy, Bessiere, et al., 2002
Mevy, J.P.; Bessiere, J.-M.; Dherbomez, M.; Viano, J., Composition and some biological activities of the essential oils from an African pasture grass: Elionurus elegans Kunth., J. Agric. Food Chem., 2002, 50, 15, 4240-4243, https://doi.org/10.1021/jf0115140 . [all data]