4-vinyl-2-methylphenol

Van Den Dool and Kratz RI, non-polar column, custom temperature program

View large format table.

Column type Active phase I Reference Comment
CapillaryDB-51317.Kirchhoff and Schieberle, 200225. m/0.32 mm/0.25 μm, He; Program: 35C (2min) => 40C/min => 50C (2min) => 4C/min => 240C (10min)

Van Den Dool and Kratz RI, polar column, custom temperature program

View large format table.

Column type Active phase I Reference Comment
CapillaryFFAP2194.Kirchhoff and Schieberle, 200230. m/0.32 mm/0.25 μm, He; Program: 35C (2min) => 60C/min => 50C (2min) => 6C/min => 240C (10min)

References

Kirchhoff and Schieberle, 2002
Kirchhoff, E.; Schieberle, P., Quantitation of odor-active compounds in rye flour and rye sourdough using stable isotope dilution assays, J. Agric. Food Chem., 2002, 50, 19, 5378-5385, https://doi.org/10.1021/jf020236h . [all data]