α-Panasinsene

Normal alkane RI, non-polar column, temperature ramp

View large format table.

Column type Active phase I Reference Comment
CapillaryMDN-51518.Jelén, 200230. m/0.25 mm/0.25 μm, 40. C @ 3. min, 8. K/min; Tend: 280. C

References

Jelén, 2002
Jelén, H.H., Volatile sesquiterpene hydrocarbons characteristic for Penicillium roqueforti strains producing PR toxin, J. Agric. Food Chem., 2002, 50, 22, 6569-6574, https://doi.org/10.1021/jf020311o . [all data]