14-Hydroxy-β-caryophyllene

Normal alkane RI, polar column, custom temperature program

Data compiled by: NIST Mass Spectrometry Data Center, William E. Wallace, director

Column type CapillaryCapillaryCapillaryCapillaryCapillary
Active phase HP-Innowax FSCHP-Innowax FSCHP-Innowax FSCInnowax FSCInnowax
Column length (m) 60.60.60.60.60.
Carrier gas N2N2N2HeHe
Substrate
Column diameter (mm) 0.250.250.250.250.25
Phase thickness (μm) 0.250.250.250.250.25
Program 60C(10min) => 4C/min => 220C(10min) => 1C/min => 240C60C(10min) => 4C/min => 220C(10min) => 1C/min => 240C60C(10min) => 4C/min => 220C(10min) => 1C/min => 240C60C (10min) => 4C/min => 220C (10min) => 1C/min => 240C60C(10min) => 4C/min => 220C(10min) => 1C/min => 240C (20min)
I 2357.2357.2357.2357.2357.
ReferenceBaser K.H.C. and Demirci B., 2007Baser K.H.C. and Demirci B., 2007Klika, Demirci, et al., 2004Demirci and Baser, 2003Tunaher, Kirimer, et al., 2003
Comment MSDC-RI MSDC-RI MSDC-RI MSDC-RI MSDC-RI
Column type CapillaryCapillaryCapillary
Active phase HP-InnowaxInnowax FSCInnowax FSC
Column length (m) 60.60.60.
Carrier gas HeHeHelium
Substrate
Column diameter (mm) 0.250.250.25
Phase thickness (μm) 0.25 0.25
Program 60 0C (10 min) 4 K/min -> 220 0C (10 min) 1 K/min -> 240 0Cnot specified60 0C (10 min) 4 0C/min -> 220 0C (10 min) 1 0C/min -> 240 0C
I 2357.2357.2357.
ReferenceDemirci, Baser, et al., 2002Demirci B., Baser K.H.C., et al., 2000Kirimer, Tabanca, et al., 1999
Comment MSDC-RI MSDC-RI MSDC-RI

Van Den Dool and Kratz RI, non-polar column, custom temperature program

Data compiled by: NIST Mass Spectrometry Data Center, William E. Wallace, director

Column type Capillary
Active phase BPX-5
Column length (m) 25.
Carrier gas He
Substrate
Column diameter (mm) 0.32
Phase thickness (μm) 0.50
Program 60C => 6C/min => 210C => 10C/min => 290C (20min)
I 1682.
ReferenceEyres, Marriott, et al., 2007
Comment MSDC-RI

References

Baser K.H.C. and Demirci B., 2007
Baser K.H.C.; Demirci B., Studies on Betula essential oils, Arkivoc, 2007, 7, 335-348. [all data]

Klika, Demirci, et al., 2004
Klika, K.D.; Demirci, B.; Salminen, J.-P.; Ovcharenko, V.V.; Vuorela, S.; Baser, K.H.C.; Pihlaja, K., New, Sesquiterpenoid-Type Bicyclic Compounds from the Buds of Betula pubescens -- Ring-Contracted Products of β-Caryophyllene?, Eur.J.Org.Chem., 2004, 2004, 12, 2627-2635, https://doi.org/10.1002/ejoc.200300808 . [all data]

Demirci and Baser, 2003
Demirci, B.; Baser, K.H.C., Essential oils from the buds of Betula spp. growing in Turkey, Flavour Fragr. J., 2003, 18, 2, 87-90, https://doi.org/10.1002/ffj.1159 . [all data]

Tunaher, Kirimer, et al., 2003
Tunaher, Z.; Kirimer, N.; Baser, K.H.C., Wood essential oils of Juniperus foetidissima Willd., Holzforschung, 2003, 57, 140-144. [all data]

Demirci, Baser, et al., 2002
Demirci, B.; Baser, K.H.C.; Tümen, G., Composition of the essential oil of Salvia aramiensis Rech. fil. growing in Turkey, Flavour Fragr. J., 2002, 17, 1, 23-25, https://doi.org/10.1002/ffj.1027 . [all data]

Demirci B., Baser K.H.C., et al., 2000
Demirci B.; Baser K.H.C.; Ozek T.; Demirci F., Betulenols from Betula species, Planta Medica, 2000, 66, 5, 490-493, https://doi.org/10.1055/s-2000-8591 . [all data]

Kirimer, Tabanca, et al., 1999
Kirimer, N.; Tabanca, N.; Ozek, T.; Basher, K.H.C.; Tumen, G., Composition of essential oils from two endemic Sideritis species of Turkey, Chem. Natural Comp., 1999, 35, 1, 61-64, https://doi.org/10.1007/BF02238211 . [all data]