4-vinyl-3-methoxyphenol

Normal alkane RI, non-polar column, temperature ramp

View large format table.

Column type Active phase I Reference Comment
CapillaryDB-51322.Czerny and Schieberle, 200230. m/0.32 mm/0.25 μm, He, 40. C @ 2. min, 6. K/min, 230. C @ 10. min

Normal alkane RI, polar column, temperature ramp

View large format table.

Column type Active phase I Reference Comment
CapillaryDB-FFAP2177.Czerny and Schieberle, 200230. m/0.32 mm/0.25 μm, He, 40. C @ 2. min, 6. K/min, 230. C @ 10. min

References

Czerny and Schieberle, 2002
Czerny, M.; Schieberle, P., Important aroma compounds in freshly ground wholemeal and white wheat flour-identification and quantitative changes during sourdough fermentation, J. Agric. Food Chem., 2002, 50, 23, 6835-6840, https://doi.org/10.1021/jf020638p . [all data]