Cyclopentane, 1-hydroxymethyl-2-methyl-5-(1-methylethenyl)

Normal alkane RI, polar column, temperature ramp

Data compiled by: NIST Mass Spectrometry Data Center, William E. Wallace, director

Column type Capillary
Active phase Carbowax 20M
Column length (m) 50.
Carrier gas He
Substrate
Column diameter (mm) 0.22
Phase thickness (μm) 0.25
Tstart (C) 60.
Tend (C) 220.
Heat rate (K/min) 2.
Initial hold (min)
Final hold (min)
I 1776.
ReferenceVernin, Lageot, et al., 2001
Comment MSDC-RI

References

Vernin, Lageot, et al., 2001
Vernin, G.; Lageot, C.; Gaydou, E.M.; Parkanyi, C., Analysis of the essential oil of Lippia graveolens HBK from El Salvador, Flavour Fragr. J., 2001, 16, 3, 219-226, https://doi.org/10.1002/ffj.984 . [all data]