(Z)-Salvene

Van Den Dool and Kratz RI, non-polar column, temperature ramp

View large format table.

Column type Active phase I Reference Comment
CapillaryDB-1853.Dob, Dahmane, et al., 200530. m/0.32 mm/0.25 μm, 50. C @ 8. min, 2. K/min; Tend: 250. C

Normal alkane RI, non-polar column, temperature ramp

View large format table.

Column type Active phase I Reference Comment
CapillaryDB-5847.Santos-Gomes and Fernandes-Ferreira, 200130. m/0.25 mm/0.25 μm, H2, 3. K/min; Tstart: 60. C; Tend: 285. C

References

Dob, Dahmane, et al., 2005
Dob, T.; Dahmane, D.; Berramdane, T.; Chelghoum, C., Chemical composition of the essential oil of Artemisia campestris L. from Algeria, Pharm. Biol., 2005, 43, 6, 512-514, https://doi.org/10.1080/13880200500220664 . [all data]

Santos-Gomes and Fernandes-Ferreira, 2001
Santos-Gomes, P.C.; Fernandes-Ferreira, M., Organ- and season-dependent variation in the essential oil composition of Salvia officinalis L. cultivated at two different sites, J. Agric. Food Chem., 2001, 49, 6, 2908-2916, https://doi.org/10.1021/jf001102b . [all data]