Propanoic acid, 2-chloro, undecyl ester

Kovats' RI, non-polar column, isothermal

View large format table.

Column type Active phase Temperature (C) I Reference Comment
CapillarySE-30140.1719.Haken and Korhonen, 1985Column length: 25. m; Column diameter: 0.33 mm
CapillarySE-30160.1725.Haken and Korhonen, 1985Column length: 25. m; Column diameter: 0.33 mm
CapillarySE-30180.1729.Haken and Korhonen, 1985Column length: 25. m; Column diameter: 0.33 mm
CapillarySE-30200.1729.Haken and Korhonen, 1985Column length: 25. m; Column diameter: 0.33 mm
CapillarySE-30220.1728.Haken and Korhonen, 1985Column length: 25. m; Column diameter: 0.33 mm
CapillarySE-30240.1736.Haken and Korhonen, 1985Column length: 25. m; Column diameter: 0.33 mm
CapillarySE-30260.1738.Haken and Korhonen, 1985Column length: 25. m; Column diameter: 0.33 mm

Kovats' RI, polar column, isothermal

View large format table.

Column type Active phase Temperature (C) I Reference Comment
CapillaryOV-351140.2112.Haken and Korhonen, 1985N2; Column length: 25. m; Column diameter: 0.32 mm
CapillaryOV-351160.2115.Haken and Korhonen, 1985N2; Column length: 25. m; Column diameter: 0.32 mm
CapillaryOV-351180.2126.Haken and Korhonen, 1985N2; Column length: 25. m; Column diameter: 0.32 mm
CapillaryOV-351200.2133.Haken and Korhonen, 1985N2; Column length: 25. m; Column diameter: 0.32 mm
CapillaryOV-351220.2145.Haken and Korhonen, 1985N2; Column length: 25. m; Column diameter: 0.32 mm

References

Haken and Korhonen, 1985
Haken, J.K.; Korhonen, I.O.O., Gas chromatography of homologous esters. XXVII. Retention increments of C1-C18 primary alkanols and their 2-chloropropanoyl and 3-chloropropanoyl derivatives on SE-30 and OV-351 capillary columns, J. Chromatogr., 1985, 319, 131-142, https://doi.org/10.1016/S0021-9673(01)90548-5 . [all data]