3-methyl-3-butenyl butanoate

Van Den Dool and Kratz RI, non-polar column, temperature ramp

View large format table.

Column type Active phase I Reference Comment
CapillaryCP Sil 5 CB1047.Pino and Marbot, 200150. m/0.32 mm/0.4 μm, He, 60. C @ 10. min, 3. K/min, 280. C @ 60. min

Van Den Dool and Kratz RI, non-polar column, custom temperature program

View large format table.

Column type Active phase I Reference Comment
CapillaryDB-5MS1063.Boulanger and Crouzet, 200130. m/0.25 mm/0.25 μm, H2; Program: 40C (5min) => 2C/min => 200C => 5C/min => 250C (15min)

Van Den Dool and Kratz RI, polar column, temperature ramp

View large format table.

Column type Active phase I Reference Comment
CapillaryAT-Wax1330.Pino and Marbot, 200160. m/0.32 mm/0.25 μm, He, 65. C @ 10. min, 2. K/min, 250. C @ 60. min

References

Pino and Marbot, 2001
Pino, J.A.; Marbot, R., Volatile flavor constituents of acerola (Malpighia emarginata DC.) fruit, J. Agric. Food Chem., 2001, 49, 12, 5880-5882, https://doi.org/10.1021/jf010270g . [all data]

Boulanger and Crouzet, 2001
Boulanger, R.; Crouzet, J., Identification of the aroma components of acerola (Malphigia glabra L.): free and bound flavor compounds, Food Chem., 2001, 74, 2, 209-216, https://doi.org/10.1016/S0308-8146(01)00128-5 . [all data]