ethyl cis-1-propenyl sulfide

Van Den Dool and Kratz RI, non-polar column, temperature ramp

Data compiled by: NIST Mass Spectrometry Data Center, William E. Wallace, director

Column type Capillary
Active phase DB-1
Column length (m) 30.
Carrier gas He
Substrate
Column diameter (mm) 0.32
Phase thickness (μm)
Tstart (C) 60.
Tend (C) 250.
Heat rate (K/min) 4.
Initial hold (min) 4.
Final hold (min)
I 763.
ReferencePino, Fuentes, et al., 2001
Comment MSDC-RI

References

Pino, Fuentes, et al., 2001
Pino, J.A.; Fuentes, V.; Correa, M.T., Volatile constituents of Chinese chive (Allium tuberosum Rottl. ex Sprengel) and Rakkyo (Allium chinense G. Don), J. Agric. Food Chem., 2001, 49, 3, 1328-1330, https://doi.org/10.1021/jf9907034 . [all data]