1,3,5-trichloroadamantane

Kovats' RI, non-polar column, isothermal

View large format table.

Column type Active phase Temperature (C) I Reference Comment
PackedSE-30150.1582.L'vova, Kurbatova, et al., 2001N2, N-AW Chromaton; Column length: 1. m
PackedSE-30150.1582.Yashkin, Kurbatova, et al., 2001CHromaton N-AW; Column length: 1. m

References

L'vova, Kurbatova, et al., 2001
L'vova, N.Yu.; Kurbatova, S.V.; Yashkin, S.N.; Kolosova, E.A., Gas chromatography of halogenated adamantanes, Russ. J. Phys. Chem. (Engl. Transl.), 2001, 75, 12, 2053-2056. [all data]

Yashkin, Kurbatova, et al., 2001
Yashkin, S.N.; Kurbatova, S.V.; Buryak, A.K., Gas chromatography of halogenated adamantanes, Russ. Chem. Bull. (Engl. Transl.), 2001, 50, 5, 828-832, https://doi.org/10.1023/A:1011350908009 . [all data]