Caryophylla-2(12),6(13)-dien-5-one

Normal alkane RI, polar column, temperature ramp

View large format table.

Column type Active phase I Reference Comment
CapillaryDB-Wax2037.Umano, Hagi, et al., 200060. m/0.25 mm/0.25 μm, He, 40. C @ 2. min, 2. K/min; Tend: 200. C

Normal alkane RI, polar column, custom temperature program

View large format table.

Column type Active phase I Reference Comment
CapillaryHP-Innowax FSC2074.Demirci B., Baser K.H.C., et al., 200660. m/0.25 mm/0.25 μm, N2; Program: 60C(10min) => 4C/min => 220C(10min) => 1C/min => 240C
CapillaryHP-Innowax FSC2074.Suleimenov Y.M., Atazhanova G.A., et al., 200660. m/0.25 mm/0.25 μm, He; Program: 60(10min) => 4C/min => 220C(10min) => 1C/min => 240C
CapillaryHP-Innowax FSC2074.Tabanca, Demirci, et al., 200660. m/0.25 mm/0.25 μm, N2; Program: 60C(10min) => 4C/min => 220C => (10min) => 1C/min => 240C
CapillaryHP-Innowax2074.Demirci, Demirci, et al., 200560. m/0.25 mm/0.25 μm, N2; Program: 60C(10min) => 4C/min => 220C (10min) => 1C/min => 240C
CapillaryHP Innowax FSP2074.Altintas, Kose, et al., 200460. m/0.25 mm/0.25 μm, N2; Program: 60C(10min) => 4C/min => 220C(10min) => 1C/min => 240C
CapillaryHP-Innowax2074.Viljoen, van Vuuren, et al., 200360. m/0.25 mm/0.25 μm; Program: 60C(10min) => 4C/min => 220C(10min) => 1C/min => 240C
CapillaryHP-Innowax2074.Gören, Demirci, et al., 200160. m/0.25 mm/0.25 μm, He; Program: 60 0C (10 min) 4 K/min -> 220 0C (10 min) 1 K/min -> 240 0C
CapillaryInnowax FSC2073.Kirimer, Tabanca, et al., 199960. m/0.25 mm/0.25 μm, Helium; Program: 60 0C (10 min) 4 0C/min -> 220 0C (10 min) 1 0C/min -> 240 0C

References

Umano, Hagi, et al., 2000
Umano, K.; Hagi, Y.; Nakahara, K.; Shoji, A.; Shibamoto, T., Volatile chemicals identified in extracts from leaves of Japanese mugwort (Artemisia princeps Pamp.), J. Agric. Food Chem., 2000, 48, 8, 3463-3469, https://doi.org/10.1021/jf0001738 . [all data]

Demirci B., Baser K.H.C., et al., 2006
Demirci B.; Baser K.H.C.; Tabanca N.; Wedge D.E., Characterization of volatile constituents of Haplopappus greenei and studies on the antifungal activity against phytopathogens, J. Agric. Food Chem., 2006, 54, 8, 3146-3150, https://doi.org/10.1021/jf053222v . [all data]

Suleimenov Y.M., Atazhanova G.A., et al., 2006
Suleimenov Y.M.; Atazhanova G.A.; Ozek T.; Demirci B.; Kulyyasov A.T.; Adekenov S.M.; Baser K.H.C., Essential oil composition of three species of Achillea from Kazakhstan, Chem. Nat. Compd. (Engl. Transl.), 2006, 37, 5, 447-450, https://doi.org/10.1023/A:1014471326724 . [all data]

Tabanca, Demirci, et al., 2006
Tabanca, N.; Demirci, B.; Can Baser, K.H.; Aytac, Z.; Ekici, M.; Khan, S.I.; Jacob, M.R.; Wedge, D.E., Chemical Composition and Antifungal Activity of Salvia macrochlamys and Salvia recognita Essential Oils, J. Agric. Food Chem., 2006, 54, 18, 6593-6597, https://doi.org/10.1021/jf0608773 . [all data]

Demirci, Demirci, et al., 2005
Demirci, B.; Demirci, F.; Baser, K.H.C., Headspace-SPME and hydrodistillation of two fragrant Artemisia sp., Flavour Fragr. J., 2005, 20, 4, 395-398, https://doi.org/10.1002/ffj.1426 . [all data]

Altintas, Kose, et al., 2004
Altintas, A.; Kose, Y.B.; Yucel, E.; Demirci, B.; Baser, K.H.C., Composition of the essential oil of Centaurea dichroa, Chem. Nat. Compd. (Engl. Transl.), 2004, 40, 6, 604-605, https://doi.org/10.1007/s10600-005-0051-9 . [all data]

Viljoen, van Vuuren, et al., 2003
Viljoen, A.; van Vuuren, S.; Ernst, E.; Klepser, M.; Demirci, B.; Baser, H.; van Wyk, B.-E., Osmitopsis asteriscoides (Asteraceae)-the antimicrobial activity and essential oil composition of a Cape-Dutch remedy, J. Ethnopharmacol., 2003, 88, 2-3, 137-143, https://doi.org/10.1016/S0378-8741(03)00191-0 . [all data]

Gören, Demirci, et al., 2001
Gören, N.; Demirci, B.; Baser, K.H.C., Composition of the essential oils of Tanacetum spp. from Turkey, Flavour Fragr. J., 2001, 16, 3, 191-194, https://doi.org/10.1002/ffj.976 . [all data]

Kirimer, Tabanca, et al., 1999
Kirimer, N.; Tabanca, N.; Ozek, T.; Basher, K.H.C.; Tumen, G., Composition of essential oils from two endemic Sideritis species of Turkey, Chem. Natural Comp., 1999, 35, 1, 61-64, https://doi.org/10.1007/BF02238211 . [all data]