Liguloxide

Van Den Dool and Kratz RI, non-polar column, temperature ramp

Data compiled by: NIST Mass Spectrometry Data Center, William E. Wallace, director

Column type CapillaryCapillaryCapillary
Active phase DB-5HP-5HP-5
Column length (m) 30.30.30.
Carrier gas HeN2N2
Substrate
Column diameter (mm) 0.250.250.25
Phase thickness (μm) 0.250.250.25
Tstart (C) 60.60.60.
Tend (C) 240.220.220.
Heat rate (K/min) 3.5.5.
Initial hold (min)  10.10.
Final hold (min)
I 1533.1532.1532.
ReferenceBaccouri, Ben Temime, et al., 2007Campeol, Flamini, et al., 2003Campeol, Flamini, et al., 2003
Comment MSDC-RI MSDC-RI MSDC-RI

Kovats' RI, non-polar column, custom temperature program

Data compiled by: NIST Mass Spectrometry Data Center, William E. Wallace, director

Column type Capillary
Active phase HP-5
Column length (m)
Carrier gas He
Substrate
Column diameter (mm)
Phase thickness (μm)
Program 60C(5min) => 3C/min => 100C => 1C/min => 160C => 10C/min => 240C(10min)
I 1530.
Referencede Marchese, de Heluani, et al., 2007
Comment MSDC-RI

References

Baccouri, Ben Temime, et al., 2007
Baccouri, B.; Ben Temime, S.; Campeol, E.; Cioni, P.L.; Daoud, D.; Zarrouk, M., Application of solid-phase microextraction to the analysis of volatile compounds in virgin olive oils from five new cultivars, Food Chem., 2007, 102, 3, 850-856, https://doi.org/10.1016/j.foodchem.2006.06.012 . [all data]

Campeol, Flamini, et al., 2003
Campeol, E.; Flamini, G.; Cioni, P.L.; Morelli, I.; Cremonini, R.; Ceccarini, L., Volatile fractions from three cultivars of Olea eruopaea L. collected in two different seasons, J. Agric. Food Chem., 2003, 51, 7, 1994-1999, https://doi.org/10.1021/jf026025u . [all data]