(E,Z)-2,4-nonadienal

Van Den Dool and Kratz RI, polar column, custom temperature program

Data compiled by: NIST Mass Spectrometry Data Center, William E. Wallace, director

Column type CapillaryCapillaryCapillaryCapillary
Active phase FFAPFFAPDB-FFAPDB-FFAP
Column length (m) 30.30.30.30.
Carrier gas HeHe
Substrate
Column diameter (mm) 0.320.320.320.32
Phase thickness (μm) 0.250.250.250.25
Program 20C(2min) => 40C/min => 50C(2min) => 4C/min => 150C => 10C/min => 240C(15min)40C(2min) => 40C/min => 60C(2min) => 6C/min => 240C(10min)40C(2min) => 40C/min => 60C (2min) => 6C/min => 180C => 10C/min => 240C (5min)40C(2min) => 40C/min => 60C (2min) => 6C/min => 180C => 10C/min => 240C (5min)
I 1655.1647.1627.1626.
ReferenceBlank, Lin, et al., 2001Kirchhoff and Schieberle, 2001Munk, Munch, et al., 2000Munk, Munch, et al., 2000
Comment MSDC-RI MSDC-RI MSDC-RI MSDC-RI

Normal alkane RI, polar column, temperature ramp

Data compiled by: NIST Mass Spectrometry Data Center, William E. Wallace, director

Column type CapillaryCapillaryCapillary
Active phase DB-FFAPDB-FFAPDB-Wax
Column length (m) 30.30.30.
Carrier gas HeHeHe
Substrate
Column diameter (mm) 0.320.320.32
Phase thickness (μm) 0.250.250.5
Tstart (C) 40.40.40.
Tend (C) 230.230.240.
Heat rate (K/min) 6.6.7.
Initial hold (min) 2.2.
Final hold (min) 10.10.5.
I 1643.1643.1670.
ReferenceCzerny and Schieberle, 2002Czerny and Schieberle, 2002Lin, Rouseff, et al., 2002
Comment MSDC-RI MSDC-RI MSDC-RI

Van Den Dool and Kratz RI, non-polar column, temperature ramp

Data compiled by: NIST Mass Spectrometry Data Center, William E. Wallace, director

Column type CapillaryCapillary
Active phase DB-5BPX-5
Column length (m) 60.50.
Carrier gas HeHe
Substrate
Column diameter (mm) 0.250.32
Phase thickness (μm) 0.250.25
Tstart (C) 40.35.
Tend (C) 275.250.
Heat rate (K/min) 7.4.
Initial hold (min)  3.
Final hold (min)  10.
I 1196.1209.
ReferenceValim, Rouseff, et al., 2003Oruna-Concha, Duckham, et al., 2001
Comment MSDC-RI MSDC-RI

Van Den Dool and Kratz RI, non-polar column, custom temperature program

View large format table.

Column type Active phase I Reference Comment
CapillaryHP-51206.Boué, Shih, et al., 200350. m/0.2 mm/0.5 μm, He; Program: 40C(3min) => 10C/min => 60C =3C/min => 150C => 20C/min => 250C (5min)
CapillaryDB-51196.Beaulieu and Grimm, 200130. m/0.25 mm/0.25 μm, He; Program: 50C (1min) => 5C/min => 100C => 10C/min => 250C (9min)
CapillaryDB-51194.Blank, Lin, et al., 200130. m/0.32 mm/0.25 μm, He; Program: 20C => 70C/min => 50C => 4C/min => 180C => 10C/min => 240C(10min)
CapillarySE-541195.Blank, Lin, et al., 200130. m/0.32 mm/0.25 μm, He; Program: 20C => 70C/min => 50C => 4C/min => 180C => 10C/min => 240C(10min)
CapillaryDB-51188.Kirchhoff and Schieberle, 200125. m/0.32 mm/0.25 μm, He; Program: 35C(2min) => 40C/min => 50C(2min) => 4C/min => 240C(10min)
CapillaryDB-51193.Munk, Munch, et al., 200030. m/0.32 mm/0.25 μm; Program: 40C(2min) => 40C/min => 50C (1min) => 6C/min => 180C => 10C/min => 240C (5min)

Van Den Dool and Kratz RI, polar column, temperature ramp

View large format table.

Column type Active phase I Reference Comment
CapillaryDB-Wax1646.Mahajan, Goddik, et al., 200430. m/0.25 mm/0.5 μm, He, 40. C @ 2. min, 5. K/min, 230. C @ 10. min
CapillaryDB-Wax1650.Nielsen, Larsen, et al., 200330. m/0.25 mm/0.25 μm, He, 40. C @ 10. min, 6. K/min, 240. C @ 30. min
CapillaryCP-Wax 52CB1617.Wu and Liou, 1992H2, 50. C @ 10. min, 1.5 K/min, 200. C @ 80. min; Column length: 50. m; Column diameter: 0.32 mm

Normal alkane RI, non-polar column, temperature ramp

View large format table.

Column type Active phase I Reference Comment
CapillaryDB-51196.Gogus, Ozel, et al., 200760. m/0.32 mm/1.0 μm, Helium, 35. C @ 7. min, 15. K/min, 240. C @ 10. min
CapillarySE-541200.Kilic, Hafizoglu, et al., 200430. m/0.053 mm/1.5 μm, He, 5. K/min; Tstart: 100. C; Tend: 250. C
CapillaryDB-51196.Czerny and Schieberle, 200230. m/0.32 mm/0.25 μm, He, 40. C @ 2. min, 6. K/min, 230. C @ 10. min
CapillaryDB-51196.Czerny and Schieberle, 200230. m/0.32 mm/0.25 μm, He, 40. C @ 2. min, 6. K/min, 230. C @ 10. min
CapillaryDB-51196.Lin, Rouseff, et al., 200230. m/0.32 mm/0.25 μm, He, 7. K/min; Tstart: 40. C; Tend: 290. C
CapillaryDB-51196.Lin, Rouseff, et al., 200230. m/0.32 mm/0.25 μm, He, 7. K/min; Tstart: 40. C; Tend: 290. C

Normal alkane RI, non-polar column, custom temperature program

View large format table.

Column type Active phase I Reference Comment
CapillaryDB-51196.Beaulieu and Lancaster, 200730. m/0.25 mm/0.25 μm; Program: 50C(1min) => 5C/min => 100C => 10C/min => 250C (9min)
CapillaryDB-51190.Matsui, Guth, et al., 199830. m/0.32 mm/0.25 μm, He; Program: 35C(1min) => 40C/min => 60C (1min) => 6C/min => 230C
CapillarySE-541191.Zehentbauer and Grosch, 199825. m/0.32 mm/0.25 μm, He; Program: 35C(2min) => 50C/min => 60C(2min) => 4C/min => 230C
CapillaryDB-51188.Schieberle and Grosch, 1994He; Column length: 30. m; Column diameter: 0.32 mm; Program: 35C => 40C/min => 50C(2min) => 4C/min => 240C

Normal alkane RI, polar column, custom temperature program

View large format table.

Column type Active phase I Reference Comment
CapillaryFFAP1632.Matsui, Guth, et al., 199830. m/0.32 mm/0.25 μm, He; Program: 35C(1min) => 40C/min => 60C (1min) => 6C/min => 230C
CapillaryFFAP1636.Zehentbauer and Grosch, 199825. m/0.32 mm/0.25 μm, He; Program: 35C(2min) => 40C/min => 60C(2min) => 6C/min => 230C
CapillarySupelcowax-101632.Schieberle and Grosch, 1994He; Column length: 30. m; Column diameter: 0.32 mm; Program: 35C => 40C/min => 60C(2min) => 4C/min => 240C

References

Blank, Lin, et al., 2001
Blank, I.; Lin, J.; Arce Vera, F.; Welti, D.H.; Fay, L.B., Identification of potent odorants formed by autoxidation of arachidonic acid: structure elucidation and synthesis of (E,Z,Z)-2,4,7-tridecatrienal, J. Agric. Food Chem., 2001, 49, 6, 2959-2965, https://doi.org/10.1021/jf010160+ . [all data]

Kirchhoff and Schieberle, 2001
Kirchhoff, E.; Schieberle, P., Determination of key aroma compounds in the crumb of a three-stage sourdough rye bread by stable isotope dilution assays and sensory studies, J. Agric. Food Chem., 2001, 49, 9, 4304-4311, https://doi.org/10.1021/jf010376b . [all data]

Munk, Munch, et al., 2000
Munk, S.; Munch, P.; Stahnke, L.; Adler-Nissen., J.; Schieberle, P., Primary odorants of laundry soiled with sweat/sebum: influence of lipase on the odor profile, Journal of Surfactants and Detergents, 2000, 3, 4, 505-515, https://doi.org/10.1007/s11743-000-0150-z . [all data]