neo-dihydro carveol acetate

Van Den Dool and Kratz RI, non-polar column, temperature ramp

View large format table.

Column type Active phase I Reference Comment
CapillaryMega 5MS1298.Verzera, Trozzi, et al., 200030. m/0.25 mm/0.25 μm, He, 40. C @ 2. min, 3. K/min; Tend: 240. C

Normal alkane RI, non-polar column, temperature ramp

View large format table.

Column type Active phase I Reference Comment
CapillaryDB-5MS1285.Marongiu, Piras, et al., 200430. m/0.25 mm/0.25 μm, He, 3. K/min, 280. C @ 30. min; Tstart: 60. C

Normal alkane RI, non-polar column, custom temperature program

View large format table.

Column type Active phase I Reference Comment
CapillaryBPX-51303.Judzentiene and Mockute, 200530. m/0.25 mm/0.25 μm; Program: 60C(0.2min) => 3K/min => 186C => 10C/min => 240C (5min)
CapillarySE-301292.Vinogradov, 2004Program: not specified
CapillaryCP Sil 8 CB1303.Mockute and Judzentiene, 200350. m/0.32 mm/0.25 μm, He; Program: 70C(5min) => 3C/min => 100C (1min) => 25C/min => 250C (10min)

Normal alkane RI, polar column, custom temperature program

View large format table.

Column type Active phase I Reference Comment
CapillaryCarbowax 20M1685.Vinogradov, 2004Program: not specified

References

Verzera, Trozzi, et al., 2000
Verzera, A.; Trozzi, A.; Cotroneo, A.; Lorenzo, D.; Dellacassa, E., Uruguayan essential oil. 12. Composition of Nova and Satsuma mandarin oils, J. Agric. Food Chem., 2000, 48, 7, 2903-2909, https://doi.org/10.1021/jf990734z . [all data]

Marongiu, Piras, et al., 2004
Marongiu, B.; Piras, A.; Porcedda, S., Comparative analysis of the oil and supercritical CO2 extract of Elettaria cardamomum (L.) maton, J. Agric. Food Chem., 2004, 52, 20, 6278-6282, https://doi.org/10.1021/jf034819i . [all data]

Judzentiene and Mockute, 2005
Judzentiene, A.; Mockute, D., The inflorescence and leaf essential oils of Tanacetum vulgare L. var. vulgare growing wild in Lithuania, Biochem. Syst. Ecol., 2005, 33, 5, 487-498, https://doi.org/10.1016/j.bse.2004.11.003 . [all data]

Vinogradov, 2004
Vinogradov, B.A., Production, composition, properties and application of essential oils, 2004, retrieved from http://viness.narod.ru. [all data]

Mockute and Judzentiene, 2003
Mockute, D.; Judzentiene, A., The myrtenol chemotype of essential oil of Tanacetum vulgare L. var. vulgare (tansy) growing wild in the Vilnius region, Chemija, 2003, 14, 2, 103-107. [all data]