(Z)-3-octen-2-one

Normal alkane RI, non-polar column, custom temperature program

Data compiled by: NIST Mass Spectrometry Data Center, William E. Wallace, director

Column type CapillaryCapillary
Active phase RTX-1OV-101
Column length (m)
Carrier gas
Substrate
Column diameter (mm)
Phase thickness (μm)
Program not specifiednot specified
I 1023.1023.
ReferenceChromTech Pty Ltd, 2006Acree and Arn, 1997
Comment MSDC-RI MSDC-RI

Van Den Dool and Kratz RI, non-polar column, custom temperature program

Data compiled by: NIST Mass Spectrometry Data Center, William E. Wallace, director

Column type Capillary
Active phase DB-5
Column length (m) 50.
Carrier gas He
Substrate
Column diameter (mm) 0.32
Phase thickness (μm) 0.5
Program oC(5min) => 60C/min => 60C (5min) => 4C/min => 250C
I 1055.
ReferenceParker, Hassell, et al., 2000
Comment MSDC-RI

References

ChromTech Pty Ltd, 2006
ChromTech Pty Ltd, Retention Data: Rtx-1, Rtx-5, Rtx-50, Rtx-Stab Kovats RI, 2006, retrieved from http://www.chromtech.net.au/pdf/RI-Flavors-20M.pdf. [all data]

Acree and Arn, 1997
Acree, T.; Arn, H., Cornell University Flavornet, 1997, retrieved from http://www.flavornet.org/flavornet.html. [all data]