(Z,Z)-2,4-decadienal

Normal alkane RI, non-polar column, temperature ramp

Data compiled by: NIST Mass Spectrometry Data Center, William E. Wallace, director

Column type CapillaryCapillary
Active phase OV-101OV-101
Column length (m) 50.50.
Carrier gas N2N2
Substrate
Column diameter (mm) 0.250.25
Phase thickness (μm)
Tstart (C) 80.80.
Tend (C) 200.200.
Heat rate (K/min) 2.2.
Initial hold (min)
Final hold (min)
I 1264.1267.
ReferenceTamura, Nakamoto, et al., 1995Tamura, Nakamoto, et al., 1995
Comment MSDC-RI MSDC-RI

Van Den Dool and Kratz RI, polar column, temperature ramp

Data compiled by: NIST Mass Spectrometry Data Center, William E. Wallace, director

Column type Capillary
Active phase Supelcowax-10
Column length (m) 30.
Carrier gas He
Substrate
Column diameter (mm) 0.25
Phase thickness (μm) 0.25
Tstart (C) 60.
Tend (C) 240.
Heat rate (K/min) 3.
Initial hold (min) 5.
Final hold (min) 10.
I 1696.
ReferenceRiu-Aumatell, Lopez-Tamames, et al., 2005
Comment MSDC-RI

References

Tamura, Nakamoto, et al., 1995
Tamura, H.; Nakamoto, H.; Yang, R.-H.; Sugisawa, H., Characteristic aroma compounds in green algae (Ulva pertusa) volatiles, Nippon Shokuhin Kagaku Kogaku Kaishi, 1995, 42, 11, 887-891, https://doi.org/10.3136/nskkk.42.887 . [all data]