3,5-dimethyl-1,2-dithiolan-4-one

Van Den Dool and Kratz RI, polar column, custom temperature program

Data compiled by: NIST Mass Spectrometry Data Center, William E. Wallace, director

Column type CapillaryCapillary
Active phase CP-Wax 52CBCP-Wax 52CB
Column length (m) 50.50.
Carrier gas
Substrate
Column diameter (mm) 0.320.32
Phase thickness (μm) 0.210.21
Program 0C(5min) => fast => 60C(5min) => 4C/min => 220C(20min)0C(5min) => fast => 60C(5min) => 4C/min => 220C(20min)
I 1568.1597.
ReferenceMadruga and Mottram, 1998Madruga and Mottram, 1998
Comment MSDC-RI MSDC-RI

References

Madruga and Mottram, 1998
Madruga, M.S.; Mottram, D.S., The effect of pH on the formation of volatile compounds produced by heating a model system containing 5'-imp and cysteine, J. Braz. Chem. Soc., 1998, 9, 3, 261-271, https://doi.org/10.1590/S0103-50531998000300010 . [all data]