Drima-7,9(11)-diene

Van Den Dool and Kratz RI, non-polar column, custom temperature program

Data compiled by: NIST Mass Spectrometry Data Center, William E. Wallace, director

Column type CapillaryCapillary
Active phase SE-525 % Phenyl methyl siloxane
Column length (m) 30.30.
Carrier gas HeHe
Substrate
Column diameter (mm) 0.320.32
Phase thickness (μm) 0.150.15
Program 45C => 1C/min => 100C => 5C/min => 250C(10min)45C => 1C/min => 100C => 5C/min => 250C (10min)
I 1473.1473.
ReferenceSacchetti, Guerrini, et al., 2006Sacchetti, Maietti, et al., 2005
Comment MSDC-RI MSDC-RI

Van Den Dool and Kratz RI, polar column, temperature ramp

Data compiled by: NIST Mass Spectrometry Data Center, William E. Wallace, director

Column type Capillary
Active phase Carbowax 20M
Column length (m) 25.
Carrier gas He
Substrate
Column diameter (mm) 0.25
Phase thickness (μm) 0.3
Tstart (C) 50.
Tend (C) 200.
Heat rate (K/min) 3.
Initial hold (min) 1.
Final hold (min) 20.
I 1668.
ReferenceBicchi, Rubiolo, et al., 2003
Comment MSDC-RI

Kovats' RI, non-polar column, custom temperature program

View large format table.

Column type Active phase I Reference Comment
CapillaryOV-11461.El-Shazly, Dorai, et al., 200215. m/0.317 mm/0.25 μm, He; Program: 50C(4min) => (4C/min) => 90C => (10C/min)=300C(10min)

Van Den Dool and Kratz RI, non-polar column, temperature ramp

View large format table.

Column type Active phase I Reference Comment
CapillaryHP-5MS1469.Pino, Mesa, et al., 200530. m/0.25 mm/0.25 μm, He, 60. C @ 2. min, 4. K/min, 250. C @ 20. min
CapillaryOV-11456.Bicchi, Rubiolo, et al., 200325. m/0.25 mm/0.3 μm, H2, 50. C @ 1. min, 3. K/min, 200. C @ 20. min
CapillaryHP-5MS1469.Demetzos, Angelopoulou, et al., 200230. m/0.25 mm/0.25 μm, 50. C @ 5. min, 3. K/min; Tend: 280. C
CapillaryDB-51473.Bortolomeazzi, Berno, et al., 200130. m/0.25 mm/0.25 μm, He, 60. C @ 3. min, 5. K/min; Tend: 300. C
CapillaryDB-51471.Nogueira, Bittrich, et al., 200130. m/0.25 mm/0.25 μm, H2, 3. K/min; Tstart: 60. C; Tend: 240. C
CapillaryDB-51473.Bortolomeazzi, Pizzale, et al., 200030. m/0.25 mm/0.25 μm, He, 60. C @ 3. min, 5. K/min; Tend: 300. C
CapillaryDB-51473.Bortolomeazzi, Pizzale, et al., 200030. m/0.25 mm/0.25 μm, He, 60. C @ 3. min, 5. K/min; Tend: 300. C

Van Den Dool and Kratz RI, polar column, custom temperature program

View large format table.

Column type Active phase I Reference Comment
CapillaryCarbowax 20M1677.Bortolomeazzi, Berno, et al., 200130. m/0.25 mm/0.25 μm, He; Program: 60C(3min) => 4C/min => 160C => 10C/min => 280C
CapillaryCarbowax 20M1677.Bortolomeazzi, Pizzale, et al., 200030. m/0.25 mm/0.25 μm, He; Program: 60C(3min) => 4C/min => 160C => 10C/min => 280C
CapillaryCarbowax 20M1677.Bortolomeazzi, Pizzale, et al., 200030. m/0.25 mm/0.25 μm, He; Program: 60C(3min) => 4C/min => 160C => 10C/min => 280C

Normal alkane RI, non-polar column, temperature ramp

View large format table.

Column type Active phase I Reference Comment
CapillarySPB-51488.Gauvin-Bialecki and Marodon, 200960. m/0.35 mm/0.25 μm, Nitrogen, 4. K/min, 230. C @ 40. min; Tstart: 60. C
CapillaryDB-51476.Morteza-Semnani K., Akbarzadeh M., et al., 200630. m/0.25 mm/0.25 μm, He, 60. C @ 5. min, 4. K/min; Tend: 220. C
CapillaryDB-51470.Mevy, Bessiere, et al., 200430. m/0.25 mm/0.15 μm, 60. C @ 3. min, 3. K/min; Tend: 220. C
CapillaryHP-51469.Mookdasanit, Tamura, et al., 2003Helium, 2. K/min, 210. C @ 60. min; Column length: 30. m; Column diameter: 0.32 mm; Tstart: 70. C
CapillaryDB-51470.da Silva, Luz, et al., 200330. m/0.25 mm/0.25 μm, He, 3. K/min; Tstart: 60. C; Tend: 240. C

Normal alkane RI, non-polar column, custom temperature program

View large format table.

Column type Active phase I Reference Comment
CapillaryHP-51469.Riahi, Pourbasheer, et al., 2009Column length: 30. m; Column diameter: 0.32 mm; Program: not specified
CapillaryDB-51469.Barros-Filho, Nunes, et al., 200430. m/0.25 mm/0.1 μm, He; Program: 35C => 4C/min => 180C => 20C/min => 280C
CapillaryDB-51468.Andrade, Maia, et al., 200030. m/0.25 mm/0.25 μm, He; Program: 40C => 2C/min => 60C => 4C/min => 260C

References

Sacchetti, Guerrini, et al., 2006
Sacchetti, G.; Guerrini, A.; Noriega, P.; Bianchi, A.; Bruni, R., Essential oil of wild Ocotea quixos (Lam.) Kosterm. (Lauraceae) leaves from Amazonian Ecuador, Flavour Fragr. J., 2006, 21, 4, 674-676, https://doi.org/10.1002/ffj.1648 . [all data]

Sacchetti, Maietti, et al., 2005
Sacchetti, G.; Maietti, S.; Muzzoli, M.; Scaglianti, M.; Manfredini, S.; Radice, M.; Bruni, R., Comparative evaluation of 11 essential oils of different origin as functional antioxidants, antiradicals and antimicrobials in foods, Food Chem., 2005, 91, 4, 621-632, https://doi.org/10.1016/j.foodchem.2004.06.031 . [all data]