trans-α-Bergamotol acetate

Normal alkane RI, non-polar column, temperature ramp

View large format table.

Column type Active phase I Reference Comment
CapillaryHP-51800.Oyedeji, Yani, et al., 200530. m/0.25 mm/0.25 μm, He, 5. K/min; Tstart: 70. C; Tend: 240. C

References

Oyedeji, Yani, et al., 2005
Oyedeji, O.A.; Yani, V.V.; Afolayan, A.J., Chemical composition of the essential oil from Arctotis arctotoides (L.F.) O. Hoffm. (syn. Vendium arctotoides Less.), Flavour Fragr. J., 2005, 20, 2, 232-234, https://doi.org/10.1002/ffj.1437 . [all data]