Acora-2,4(15)-dien-11-ol

Normal alkane RI, non-polar column, custom temperature program

Data compiled by: NIST Mass Spectrometry Data Center, William E. Wallace, director

Column type Capillary
Active phase CP Sil 5 CB
Column length (m) 25.
Carrier gas N2
Substrate
Column diameter (mm) 0.25
Phase thickness (μm) 0.39
Program not specified
I 1612.
ReferenceWeyerstahl, Marschall, et al., 1999
Comment MSDC-RI

References

Weyerstahl, Marschall, et al., 1999
Weyerstahl, P.; Marschall, H.; Eckhardt. A.; Christiansen, C., Constituents of commercial Brazilian Iantana oil, Flavour Fragr. J., 1999, 14, 1, 15-28, https://doi.org/10.1002/(SICI)1099-1026(199901/02)14:1<15::AID-FFJ777>3.0.CO;2-M . [all data]