6,10-epoxybisabol-2-en-12-al

Normal alkane RI, non-polar column, custom temperature program

View large format table.

Column type Active phase I Reference Comment
CapillaryCP Sil 5 CB1658.Weyerstahl, Marschall, et al., 199925. m/0.25 mm/0.39 μm, N2; Program: not specified

References

Weyerstahl, Marschall, et al., 1999
Weyerstahl, P.; Marschall, H.; Eckhardt. A.; Christiansen, C., Constituents of commercial Brazilian Iantana oil, Flavour Fragr. J., 1999, 14, 1, 15-28, https://doi.org/10.1002/(SICI)1099-1026(199901/02)14:1<15::AID-FFJ777>3.0.CO;2-M . [all data]