10-epi- α-cadinol

Van Den Dool and Kratz RI, non-polar column, temperature ramp

View large format table.

Column type Active phase I Reference Comment
CapillaryCP Sil 5 CB1632.Weyerstahl, Marschall, et al., 1999He, 5. K/min; Column length: 25. m; Column diameter: 0.25 mm; Tstart: 60. C; Tend: 260. C

Normal alkane RI, non-polar column, temperature ramp

View large format table.

Column type Active phase I Reference Comment
CapillarySPB-51635.Stojanovic, Palic, et al., 2006He, 50. C @ 3. min, 5. K/min, 250. C @ 15. min

References

Weyerstahl, Marschall, et al., 1999
Weyerstahl, P.; Marschall, H.; Wahlburg, H.-C.; Christiansen, C.; Rustaiyan, A.; Mirdjalili, F., Constituents of the essential oil of Pulicaria gnaphalodes (Vent.) Boiss. from Iran, Flavour Fragr. J., 1999, 14, 2, 121-130, https://doi.org/10.1002/(SICI)1099-1026(199903/04)14:2<121::AID-FFJ790>3.0.CO;2-K . [all data]

Stojanovic, Palic, et al., 2006
Stojanovic, G.; Palic, I.; Ursic-Jankovic, J., Composition and antimicrobial activity of the essential oil of Micromeria cristata and Micromeria juliana, Flavour Fragr. J., 2006, 21, 1, 77-79, https://doi.org/10.1002/ffj.1507 . [all data]