6-epi-6,9-Epoxyfarnesa-1,7(14),10-trien-3-ol

Van Den Dool and Kratz RI, non-polar column, temperature ramp

View large format table.

Column type Active phase I Reference Comment
CapillaryBP-11614.Blanc, Bradesi, et al., 200650. m/0.22 mm/0.25 μm, 2. K/min, 220. C @ 20. min; Tstart: 60. C

Van Den Dool and Kratz RI, polar column, temperature ramp

View large format table.

Column type Active phase I Reference Comment
CapillaryBP-202276.Blanc, Bradesi, et al., 200650. m/0.22 mm/0.25 μm, 2. K/min, 220. C @ 20. min; Tstart: 60. C

Normal alkane RI, non-polar column, temperature ramp

View large format table.

Column type Active phase I Reference Comment
CapillaryCP Sil 5 CB1614.Weyerstahl, Marschall, et al., 1999N2, 5. K/min; Column length: 25. m; Phase thickness: 0.39 μm; Tstart: 60. C; Tend: 220. C

Normal alkane RI, polar column, temperature ramp

View large format table.

Column type Active phase I Reference Comment
CapillaryDB-Wax2284.Weyerstahl, Marschall, et al., 1999N2, 5. K/min; Column length: 60. m; Phase thickness: 0.25 μm; Tstart: 60. C; Tend: 220. C

References

Blanc, Bradesi, et al., 2006
Blanc, M.-C.; Bradesi, P.; Goncalves, M.J.; Salgueiro, L.; Casanova, J., Essential oil of Dittrichia viscosa ssp. viscosa: analysis by 13C-NMR and antimicrobial activity, Flavour Fragr. J., 2006, 21, 2, 324-332, https://doi.org/10.1002/ffj.1605 . [all data]

Weyerstahl, Marschall, et al., 1999
Weyerstahl, P.; Marschall, H.; Thefeld, K.; Rustaiyan, A., Constituents of the essential oil of Tanacetum (syn. Chrysanthemum) fruticulosum Ledeb. from Iran, Flavour Fragr. J., 1999, 14, 2, 112-120, https://doi.org/10.1002/(SICI)1099-1026(199903/04)14:2<112::AID-FFJ786>3.0.CO;2-1 . [all data]