4-Hydroxy-2-isopropenyl-5-methylhex-5-enyl isobutyrate

Normal alkane RI, non-polar column, temperature ramp

View large format table.

Column type Active phase I Reference Comment
CapillaryCP Sil 5 CB1539.Weyerstahl, Marschall, et al., 1999N2, 5. K/min; Column length: 25. m; Phase thickness: 0.39 μm; Tstart: 60. C; Tend: 220. C

Normal alkane RI, polar column, temperature ramp

View large format table.

Column type Active phase I Reference Comment
CapillaryDB-Wax2229.Weyerstahl, Marschall, et al., 1999N2, 5. K/min; Column length: 60. m; Phase thickness: 0.25 μm; Tstart: 60. C; Tend: 220. C

References

Weyerstahl, Marschall, et al., 1999
Weyerstahl, P.; Marschall, H.; Thefeld, K.; Rustaiyan, A., Constituents of the essential oil of Tanacetum (syn. Chrysanthemum) fruticulosum Ledeb. from Iran, Flavour Fragr. J., 1999, 14, 2, 112-120, https://doi.org/10.1002/(SICI)1099-1026(199903/04)14:2<112::AID-FFJ786>3.0.CO;2-1 . [all data]