α-Acoradiene

Van Den Dool and Kratz RI, non-polar column, temperature ramp

Data compiled by: NIST Mass Spectrometry Data Center, William E. Wallace, director

Column type CapillaryCapillaryCapillaryCapillary
Active phase HP-5MSDB-1HP-5HP-5
Column length (m) 30.30.30.30.
Carrier gas HeN2HeHe
Substrate
Column diameter (mm) 0.250.250.250.25
Phase thickness (μm) 0.250.250.250.25
Tstart (C) 60.50.60.60.
Tend (C) 280.220.280.280.
Heat rate (K/min) 4.4.4.3.
Initial hold (min) 5. 5.5.
Final hold (min)
I 1463.1461.1463.1461.
ReferenceSaroglou, Marin, et al., 2007Kuiate, Bessière, et al., 2006Skaltsa, Demetzos, et al., 2003Aligiannis, Kalpoutzakis, et al., 2001
Comment MSDC-RI MSDC-RI MSDC-RI MSDC-RI

Normal alkane RI, non-polar column, custom temperature program

Data compiled by: NIST Mass Spectrometry Data Center, William E. Wallace, director

Column type CapillaryCapillaryCapillary
Active phase DB-1CP Sil 8 CBDB-5
Column length (m) 30.50.30.
Carrier gas HydrogenHeHe
Substrate
Column diameter (mm) 0.250.320.25
Phase thickness (μm) 0.25 0.1
Program 45 0C 3 0C/min -> 175 0C 15 0C/min -> 300 0C (10 min)60C(2min) => 5C/min => 160C (1min) => 10C/min => 250C (2min)35C => 4C/min => 180C => 20C/min => 280C
I 1455.1475.1463.
ReferenceMendes, Trindade, et al., 2009Judpentienë and Mockutë, 2004Viana, Andrade-Neto, et al., 2002
Comment MSDC-RI MSDC-RI MSDC-RI

References

Saroglou, Marin, et al., 2007
Saroglou, V.; Marin, P.D.; Rancic, A.; Veljic, M.; Skaltsa, H., Composition and antimicrobial activity of the essential oil of six Hypericum species from Serbia, Biochem. Syst. Ecol., 2007, 35, 3, 146-152, https://doi.org/10.1016/j.bse.2006.09.009 . [all data]

Kuiate, Bessière, et al., 2006
Kuiate, J.R.; Bessière, J.M.; Vilarem, G.; Amvam Zollo, P.H., Chemical composition and antidermatophytic properties of the essential oils from leaves, flowers and fruits of Cupressus lusitanica Mill. from Cameroon, Flavour Fragr. J., 2006, 21, 4, 693-697, https://doi.org/10.1002/ffj.1686 . [all data]

Skaltsa, Demetzos, et al., 2003
Skaltsa, H.D.; Demetzos, C.; Lazari, D.; Sokovic, M., Essential oil analysis and antimicrobial activity of eight Stachys species from Greece, Phytochemistry, 2003, 64, 3, 743-752, https://doi.org/10.1016/S0031-9422(03)00386-8 . [all data]

Aligiannis, Kalpoutzakis, et al., 2001
Aligiannis, N.; Kalpoutzakis, E.; Chinou, I.B.; Mitaku, S.; Gikas, E.; Tsarbopoulos, A., Composition and antimicrobial activity of the essential oils of five taxa of Sideritis from Greece, J. Agric. Food Chem., 2001, 49, 2, 811-815, https://doi.org/10.1021/jf001018w . [all data]