(E)-Cyclanthone

Normal alkane RI, non-polar column, temperature ramp

View large format table.

Column type Active phase I Reference Comment
CapillaryDB-11194.Schultz, Kaiser, et al., 19994. K/min; Tstart: 50. C; Tend: 260. C

References

Schultz, Kaiser, et al., 1999
Schultz, K.; Kaiser, R.; Knudsen, J.T., Cyclanthone and derivatives, new natural products in the flower scent of Cyclanthus bipartitus Poit., Flavour Fragr. J., 1999, 14, 3, 185-190, https://doi.org/10.1002/(SICI)1099-1026(199905/06)14:3<185::AID-FFJ809>3.0.CO;2-7 . [all data]