(E)-α-Bisabolene

Van Den Dool and Kratz RI, non-polar column, temperature ramp

Data compiled by: NIST Mass Spectrometry Data Center, William E. Wallace, director

Column type CapillaryCapillaryCapillaryCapillaryCapillary
Active phase RTX-1RTX-1RTX-1HP-5RTX-1
Column length (m) 60.60.60.30.60.
Carrier gas HeHeHeHeHe
Substrate
Column diameter (mm) 0.220.220.220.250.22
Phase thickness (μm) 0.250.250.250.250.25
Tstart (C) 60.60.60.60.60.
Tend (C) 230.230.230.250.230.
Heat rate (K/min) 2.2.2.3.2.
Initial hold (min)
Final hold (min) 35.35.45. 35.
I 1534.1534.1533.1545.1527.
ReferencePaolini J., Costa J., et al., 2007Paolini, Muselli, et al., 2007Cavalli, Tomi, et al., 2006Javidnia, Miri, et al., 2006Paolini J., Desjobert J.M., et al., 2006
Comment MSDC-RI MSDC-RI MSDC-RI MSDC-RI MSDC-RI
Column type CapillaryCapillaryCapillaryCapillaryCapillary
Active phase SPB-1BP-1BP-1HP-5RTX-1
Column length (m) 30.50.50.50.60.
Carrier gas HeHe HeHe
Substrate
Column diameter (mm) 0.250.220.220.20.22
Phase thickness (μm) 0.250.250.250.20.25
Tstart (C) 50.60.60.35.60.
Tend (C) 250.220.220.250.230.
Heat rate (K/min) 5.2.2.3.2.
Initial hold (min) 3.  15.
Final hold (min) 15.20.20.40.45.
I 1557.1530.1533.1530.1533.
ReferenceRadulovic, Mananjarasoa, et al., 2006Boti J.B., Koukoua G., et al., 2005Gonny, Bradesi, et al., 2004Stashenko, Jaramillo, et al., 2004Cavalli, Tomi, et al., 2003
Comment MSDC-RI MSDC-RI MSDC-RI MSDC-RI MSDC-RI
Column type Capillary
Active phase RTX-5
Column length (m) 30.
Carrier gas He
Substrate
Column diameter (mm) 0.25
Phase thickness (μm) 0.25
Tstart (C) 45.
Tend (C) 300.
Heat rate (K/min) 3.
Initial hold (min) 6.
Final hold (min) 10.
I 1547.
ReferenceMondello, Zappia, et al., 2002
Comment MSDC-RI

Normal alkane RI, non-polar column, temperature ramp

Data compiled by: NIST Mass Spectrometry Data Center, William E. Wallace, director

Column type CapillaryCapillaryCapillaryCapillaryCapillary
Active phase HP-5BP-1HP-5MSHP-5HP-5
Column length (m) 30.50.30.30.30.
Carrier gas HeHeHeHeHelium
Substrate
Column diameter (mm) 0.250.220.250.250.32
Phase thickness (μm) 0.250.250.250.250.25
Tstart (C) 50.60.60.50.40.
Tend (C) 300.220.280.300.300.
Heat rate (K/min) 5.2.4.5.4.
Initial hold (min) 5.  5.
Final hold (min) 5.20. 5.5.
I 1538.1532.1544.1538.1536.
ReferenceFiguérédo, Cabassu, et al., 2006Lesueur, Ban, et al., 2006Sajjadi, 2006Figuérédo, Cabassu, et al., 2005Utsunomia, Kawata, et al., 2005
Comment MSDC-RI MSDC-RI MSDC-RI MSDC-RI MSDC-RI
Column type CapillaryCapillary
Active phase DB-1CP Sil 5 CB
Column length (m) 33.25.
Carrier gas N2He
Substrate
Column diameter (mm) 0.250.25
Phase thickness (μm) 0.50
Tstart (C) 50.50.
Tend (C) 135.230.
Heat rate (K/min) 20.3.
Initial hold (min) 2.
Final hold (min)
I 1537.1543.
ReferenceFeger, Brandauer, et al., 2000Oyedeji, Olawore, et al., 1999
Comment MSDC-RI MSDC-RI

Normal alkane RI, polar column, custom temperature program

Data compiled by: NIST Mass Spectrometry Data Center, William E. Wallace, director

Column type CapillaryCapillaryCapillaryCapillary
Active phase Innowax FSCHP-Innowax FSCInnowax FSCHP-Innowax FSC
Column length (m) 60.60.60.60.
Carrier gas HeHeHeHe
Substrate
Column diameter (mm) 0.250.250.250.25
Phase thickness (μm) 0.250.250.250.25
Program 60C(10min) => 4C/min => 220C (10min) => 1C/min => 240C60C(10min) => 4C/min => 220C(10min) => 1C/min => 240C60C(10min) => 4C/min => 220C(10min) => 1C/min => 240C60C(10min) => 4C/min => 220C(10min) => 1C/min => 240C
I 1784.1784.1786.1784.
ReferenceTosun, Kürkcüoglu, et al., 2006Tabanca, Demirci, et al., 2005Baser, Özek, et al., 2004Erdemoglu, Sener, et al., 2003
Comment MSDC-RI MSDC-RI MSDC-RI MSDC-RI

References

Paolini J., Costa J., et al., 2007
Paolini J.; Costa J.; Bernardini A.F., Analysis of the essential oil from the roots of Eupatorium cannabinum subsp corsicum (L.) by GC, GC-MS and C-13-NMR, Phytochem. Anal., 2007, 18, 3, 235-244, https://doi.org/10.1002/pca.977 . [all data]

Paolini, Muselli, et al., 2007
Paolini, J.; Muselli, A.; Bernardini, A.-F.; Bighelli, A.; Casanova, J.; Costa, J., Thymol derivatives from essential oil of Doronicum corsicum L., Flavour Fragr. J., 2007, 22, 6, 479-487, https://doi.org/10.1002/ffj.1824 . [all data]

Cavalli, Tomi, et al., 2006
Cavalli, J.-F.; Tomi, F.; Bernardini, A.-F.; Casanova, J., Chemical variability of the essential oil of Helichrysum faradifani Sc. Ell. from Madagascar, Flavour Fragr. J., 2006, 21, 1, 111-114, https://doi.org/10.1002/ffj.1531 . [all data]

Javidnia, Miri, et al., 2006
Javidnia, K.; Miri, R.; Kamalinejad, M.; Khazraii, H., Chemical composition of the volatile oil of aerial parts of Valeriana sisymbriifolia Vahl. grown in Iran, Flavour Fragr. J., 2006, 21, 3, 516-518, https://doi.org/10.1002/ffj.1660 . [all data]

Paolini J., Desjobert J.M., et al., 2006
Paolini J.; Desjobert J.M.; Costa J.; Bernardini A.F.; Castellini C.B.; Cioni P.L.; Flamini G.; Morelli I., Composition of essential oils of Helichrysum italicum (Roth) G. Don fil subsp. italicum from Tuscan archipelago islands, Flavour Fragr. J., 2006, 21, 5, 805-808, https://doi.org/10.1002/ffj.1726 . [all data]

Radulovic, Mananjarasoa, et al., 2006
Radulovic, N.; Mananjarasoa, E.; Harinantenaina, L.; Yoshinori, A., Essential oil composition of four Croton species from Madagascar and their chemotaxonomy, Biochem. Syst. Ecol., 2006, 34, 8, 648-653, https://doi.org/10.1016/j.bse.2006.02.005 . [all data]

Boti J.B., Koukoua G., et al., 2005
Boti J.B.; Koukoua G.; N'Guessan T.Y.; Muselli A.; Bernardini A.F.; Casanova J., Composition of the leaf, stem bark and root bark oils of Isolona cooperi investigated by GC (retention index), GC-MS and C-13-NMR spectroscopy, Phytochem. Anal., 2005, 16, 5, 357-363, https://doi.org/10.1002/pca.857 . [all data]

Gonny, Bradesi, et al., 2004
Gonny, M.; Bradesi, P.; Casanova, J., Identification of the components of the essential oil from wild Corsican Daucus carota L. using 13C-NMR spectroscopy, Flavour Fragr. J., 2004, 19, 5, 424-433, https://doi.org/10.1002/ffj.1330 . [all data]

Stashenko, Jaramillo, et al., 2004
Stashenko, E.E.; Jaramillo, B.E.; Martínez, J.R., Comparison of different extraction methods for the analysis of volatile secondary metabolites of Lippia alba (Mill.) N.E. Brown, grown in Colombia, and evaluation of its in vitro antioxidant activity, J. Chromatogr. A, 2004, 1025, 1, 93-103, https://doi.org/10.1016/j.chroma.2003.10.058 . [all data]

Cavalli, Tomi, et al., 2003
Cavalli, J.-F.; Tomi, F.; Bernardini, A.-F.; Casanova, J., Composition and chemical variability of the bark oil of Cedrelopsis grevei H. Baillon from Madagascar, Flavour Fragr. J., 2003, 18, 6, 532-538, https://doi.org/10.1002/ffj.1263 . [all data]

Mondello, Zappia, et al., 2002
Mondello, L.; Zappia, G.; Cotroneo, A.; Bonaccorsi, I.; Chowdhury, J.U.; Yusuf, M.; Dugo, G., Studies on the essential oil-bearing plants of Bangladesh. Part VIII. Composition of some Ocimum oils O. basilicum L. var. purpurascens; O. sanctum L. green; O. sanctum L. purple; O. americanum L., citral type; O. americanum L., camphor type, Flavour Fragr. J., 2002, 17, 5, 335-340, https://doi.org/10.1002/ffj.1108 . [all data]