Acora-4,9-diene

Van Den Dool and Kratz RI, non-polar column, temperature ramp

View large format table.

Column type Active phase I Reference Comment
CapillaryBP-11444.Mazzoni, Tomi, et al., 199950. m/0.22 mm/0.25 μm, He, 2. K/min, 220. C @ 20. min; Tstart: 60. C

Van Den Dool and Kratz RI, polar column, temperature ramp

View large format table.

Column type Active phase I Reference Comment
CapillaryBP-201622.Mazzoni, Tomi, et al., 199950. m/0.22 mm/0.25 μm, He, 2. K/min, 220. C @ 20. min; Tstart: 60. C

References

Mazzoni, Tomi, et al., 1999
Mazzoni, V.; Tomi, F.; Casanova, J., A daucane-type sesquiterpene from Faucus carota seed oil, Flavour Fragr. J., 1999, 14, 5, 268-272, https://doi.org/10.1002/(SICI)1099-1026(199909/10)14:5<268::AID-FFJ823>3.0.CO;2-Z . [all data]