Hex-3-enyl 2-methylbutanoate

Normal alkane RI, non-polar column, custom temperature program

Data compiled by: NIST Mass Spectrometry Data Center, William E. Wallace, director

Column type Capillary
Active phase DB-5
Column length (m) 30.
Carrier gas
Substrate
Column diameter (mm) 0.32
Phase thickness (μm) 1.
Program 0C(5min) => 60C/min => 60C (5min) => 4C/min => 250C (5min)
I 1224.
ReferenceStorer, Elmore, et al., 1993
Comment MSDC-RI

References

Storer, Elmore, et al., 1993
Storer, J.R.; Elmore, J.S.; van Emden, H.F., Airborne volatiles from the foliage of three cultivars of autumn flowering chrysanthemums, Phytochemistry, 1993, 34, 6, 1489-1492, https://doi.org/10.1016/S0031-9422(00)90833-1 . [all data]