(E,Z)-Marticaria ester

Van Den Dool and Kratz RI, non-polar column, temperature ramp

Data compiled by: NIST Mass Spectrometry Data Center, William E. Wallace, director

Column type Capillary
Active phase DB-1
Column length (m) 60.
Carrier gas He
Substrate
Column diameter (mm) 0.32
Phase thickness (μm)
Tstart (C) 60.
Tend (C) 230.
Heat rate (K/min) 3.
Initial hold (min)
Final hold (min) 5.
I 1499.
ReferenceJavidnia and Shafiee, 1999
Comment MSDC-RI

References

Javidnia and Shafiee, 1999
Javidnia, K.; Shafiee, A., Constituents of the essential oil of Matricaria decipiens C. Koch, Flavour Fragr. J., 1999, 14, 3, 153-155, https://doi.org/10.1002/(SICI)1099-1026(199905/06)14:3<153::AID-FFJ792>3.0.CO;2-V . [all data]