2,3-Dihydro-5-hydroxy-6-methyl-4(H)-pyran-4-one

Normal alkane RI, non-polar column, custom temperature program

Data compiled by: NIST Mass Spectrometry Data Center, William E. Wallace, director

Column type Capillary
Active phase CP Sil 5 CB
Column length (m) 50.
Carrier gas
Substrate
Column diameter (mm) 0.32
Phase thickness (μm) 1.2
Program 36C => 20C/min => 120C(20min) => 2C/min => 250C(30min)
I 1066.
ReferenceLermusieau, Bulens, et al., 2001
Comment MSDC-RI

Van Den Dool and Kratz RI, non-polar column, temperature ramp

View large format table.

Column type Active phase I Reference Comment
CapillaryBPX-51104.Hill, Isaacs, et al., 199950. m/0.325 mm/0.5 μm, He, 20. C @ 2. min, 4. K/min, 250. C @ 10. min

Van Den Dool and Kratz RI, non-polar column, custom temperature program

View large format table.

Column type Active phase I Reference Comment
CapillarySE-541079.Engel, Hoffmann, et al., 200130. m/0.32 mm/0.25 μm; Program: 35C(1min) => 6C/min => 150C => 10C/min => 230C
CapillarySE-541088.Zimmermann and Schieberle, 200030. m/0.25 mm/0.25 μm, He; Program: 35C(2min) => 40C/min => 60C => 6C/min => 180C 20C/min => 240C(10min)
CapillarySE-541076.Fickert and Schieberle, 199825. m/0.32 mm/0.5 μm, He; Program: 35C (2min) => 4C/min => 150C => 10C/min => 240C

Van Den Dool and Kratz RI, polar column, temperature ramp

View large format table.

Column type Active phase I Reference Comment
CapillaryCP-WAX 57CB1848.Baltes and Mevissen, 1988He, 50. C @ 5. min, 2. K/min; Column length: 50. m; Column diameter: 0.24 mm; Tend: 210. C

Van Den Dool and Kratz RI, polar column, custom temperature program

View large format table.

Column type Active phase I Reference Comment
CapillaryStabilwax1870.Natali N., Chinnici F., et al., 200630. m/0.25 mm/0.25 μm, He; Program: 40C => 3C/min => 100C => 5C/min => 240C(10min)
CapillaryFFAP1860.Engel, Hoffmann, et al., 200130. m/0.32 mm/0.25 μm; Program: 35C(1min) => 40C/min => 60C => 6C/min => 230C
CapillaryFFAP1879.Zimmermann and Schieberle, 200030. m/0.25 mm/0.25 μm, He; Program: 35C(2min) => 40C/min => 60C => 6C/min => 180C 20C/min => 240C(10min)
CapillaryFFAP1870.Fickert and Schieberle, 199825. m/0.32 mm/0.5 μm, He; Program: 35C (2min) => 40C/min => 60C => 6C/min => 230C (10min)

Normal alkane RI, polar column, temperature ramp

View large format table.

Column type Active phase I Reference Comment
CapillaryCarbowax 20M1868.Cutzach, Chatonnet, et al., 199750. m/0.25 mm/0.25 μm, 3. K/min, 230. C @ 30. min; Tstart: 45. C

Normal alkane RI, polar column, custom temperature program

View large format table.

Column type Active phase I Reference Comment
CapillaryDB-Wax1848.Gonzalez-Rios, Suarez-Quiroz, et al., 200730. m/0.25 mm/0.25 μm, Hydrogen; Program: 44 0C 3 0C/min -> 170 0C 8 0C/min -> 250 0C

References

Lermusieau, Bulens, et al., 2001
Lermusieau, G.; Bulens, M.; Collin, S., Use of GC-olfactometry to identify the hop aromatic compounds in beer, J. Agric. Food Chem., 2001, 49, 8, 3867-3874, https://doi.org/10.1021/jf0101509 . [all data]