2-octyl-4,5-dimethyl-3-thiazoline

Van Den Dool and Kratz RI, non-polar column, custom temperature program

View large format table.

Column type Active phase I Reference Comment
CapillaryCP-Sil 8CB-MS1702.Elmore, Mottram, et al., 200060. m/0.25 mm/0.25 μm, He; Program: 0C(5min) => 40C/min => 40C (2min) => 4C/min => 280C
CapillaryCP-Sil 8CB-MS1712.Elmore, Mottram, et al., 200060. m/0.25 mm/0.25 μm, He; Program: 0C(5min) => 40C/min => 40C (2min) => 4C/min => 280C
CapillaryBPX-51706.Elmore, Mottram, et al., 199950. m/0.32 mm/0.5 μm, He; Program: 0C(5min) => 40C/min => 40C(2min) => 4C/min => 280C
CapillaryBPX-51716.Elmore, Mottram, et al., 199950. m/0.32 mm/0.5 μm, He; Program: 0C(5min) => 40C/min => 40C(2min) => 4C/min => 280C

References

Elmore, Mottram, et al., 2000
Elmore, J.S.; Mottram, D.S.; Enser, M.; Wood, J.D., The effects of diet and breed on the volatile compounds of cooked lamb, Meat Sci., 2000, 55, 2, 149-159, https://doi.org/10.1016/S0309-1740(99)00137-0 . [all data]

Elmore, Mottram, et al., 1999
Elmore, J.S.; Mottram, D.S.; Enser, M.; Wood, J.D., Effect of the polyunsaturated fatty acid composition of beef muscle on the profile of aroma volatiles, J. Agric. Food Chem., 1999, 47, 4, 1619-1625, https://doi.org/10.1021/jf980718m . [all data]